OpenPegasus Nightly Build & Regression Testing Status

Platform Report

Return to Index

Platform LINUX_IX86_GNU_(RHEL5)(+CMPI,_+ICU,_+SSL)
Branch RELEASE_2_7-BRANCH
Options +CMPI,+ICU,+SSL
Date 02-Feb-09 21:02
Contributor IBM
Status FAILURE
Data
Platform: LINUX_IX86_GNU (RHEL5)(+CMPI, +ICU, +SSL)
Branch: RELEASE_2_7-branch
Date: 090202
Time: 2102 GMT
Contributor: IBM
Options: +CMPI, +ICU, +SSL
Status:FAILURE

-------------------------------------------------------

The Time Format is HHMMSS GMT time

CVS checkout Start time : 210139
CVS checkout End time : 210249


touch /opt/NightlyBuild/pegasusbuild/runtime/bin/chksrc

touch /opt/NightlyBuild/pegasusbuild/runtime/bin/chksrc

make[3]: Leaving directory `/opt/NightlyBuild/pegasusbuild/pegasus/src/utils/chksrc'
make[3]: Entering directory `/opt/NightlyBuild/pegasusbuild/pegasus/src/utils/cnv2rootbundle'
g++ -c -o /opt/NightlyBuild/pegasusbuild/runtime/obj/utils/cnv2rootbundle/cnv2rootbundle.o -W -Wall -Wno-unused -D_GNU_SOURCE -DTHREAD_SAFE -D_REENTRANT -g -m32 -fvisibility=hidden -fPIE -DPEGASUS_PLATFORM_LINUX_GENERIC_GNU -DPEGASUS_PLATFORM_LINUX_IX86_GNU -DPEGASUS_USE_SYSLOGS -DPEGASUS_HAS_MESSAGES -DPEGASUS_HAS_ICU -DPEGASUS_ARCH_LIB="lib" -DPEGASUS_DEFAULT_ENABLE_OOP -DPEGASUS_EMBEDDED_INSTANCE_SUPPORT -DPEGASUS_HAS_SSL -DPEGASUS_SSL_RANDOMFILE -DPEGASUS_ENABLE_SSL_CRL_VERIFICATION -DPEGASUS_ENABLE_AUDIT_LOGGER -DPEGASUS_ENABLE_IPV6 -DPEGASUS_ENABLE_INTEROP_PROVIDER -DPEGASUS_DEBUG -DPEGASUS_USE_EXPERIMENTAL_INTERFACES -DPEGASUS_USE_DEPRECATED_INTERFACES -DPEGASUS_ENABLE_CMPI_PROVIDER_MANAGER -DPEGASUS_DEST_LIB_DIR="lib" -DPLATFORM_COMPONENT_NAME="cnv2rootbundle" -I/opt/pegDailyBuild/builddir/icu/source/common -I/opt/pegDailyBuild/builddir/icu/source/i18n -I/opt/NightlyBuild/pegasusbuild/pegasus/src cnv2rootbundle.cpp

g++ -W -Wall -Wno-unused -D_GNU_SOURCE -DTHREAD_SAFE -D_REENTRANT -g -m32 -fvisibility=hidden -fPIE -Xlinker -rpath -Xlinker /opt/NightlyBuild/pegasusbuild/runtime/lib -Xlinker -rpath -Xlinker /opt/NightlyBuild/icu/lib -L/opt/NightlyBuild/pegasusbuild/runtime/lib -o /opt/NightlyBuild/pegasusbuild/runtime/bin/cnv2rootbundle /opt/NightlyBuild/pegasusbuild/runtime/obj/utils/cnv2rootbundle/cnv2rootbundle.o -ldl -lpthread -lcrypt -L/opt/NightlyBuild/icu/lib -licui18n -licuuc -L/opt/NightlyBuild/icu/lib -licuuc -licui18n -licudata
touch /opt/NightlyBuild/pegasusbuild/runtime/bin/cnv2rootbundle

touch /opt/NightlyBuild/pegasusbuild/runtime/bin/cnv2rootbundle

make[3]: Leaving directory `/opt/NightlyBuild/pegasusbuild/pegasus/src/utils/cnv2rootbundle'
make[3]: Entering directory `/opt/NightlyBuild/pegasusbuild/pegasus/src/utils/stripcrs'
make[3]: `/opt/NightlyBuild/pegasusbuild/runtime/bin/stripcrs' is up to date.
make[3]: Leaving directory `/opt/NightlyBuild/pegasusbuild/pegasus/src/utils/stripcrs'
make[2]: Leaving directory `/opt/NightlyBuild/pegasusbuild/pegasus/src/utils'
make[2]: Entering directory `/opt/NightlyBuild/pegasusbuild/pegasus/src/Pegasus'
make[3]: Entering directory `/opt/NightlyBuild/pegasusbuild/pegasus/src/Pegasus/Common'
g++ -c -o /opt/NightlyBuild/pegasusbuild/runtime/obj/Pegasus/Common/Executor.o -W -Wall -Wno-unused -D_GNU_SOURCE -DTHREAD_SAFE -D_REENTRANT -g -m32 -fvisibility=hidden -fPIC -DPEGASUS_COMMON_INTERNAL -DPEGASUS_INTERNALONLY -DPEGASUS_PLATFORM_LINUX_GENERIC_GNU -DPEGASUS_PLATFORM_LINUX_IX86_GNU -DPEGASUS_USE_SYSLOGS -DPEGASUS_HAS_MESSAGES -DPEGASUS_HAS_ICU -DPEGASUS_ARCH_LIB="lib" -DPEGASUS_DEFAULT_ENABLE_OOP -DPEGASUS_EMBEDDED_INSTANCE_SUPPORT -DPEGASUS_HAS_SSL -DPEGASUS_SSL_RANDOMFILE -DPEGASUS_ENABLE_SSL_CRL_VERIFICATION -DPEGASUS_ENABLE_AUDIT_LOGGER -DPEGASUS_ENABLE_IPV6 -DPEGASUS_ENABLE_INTEROP_PROVIDER -DPEGASUS_DEBUG -DPEGASUS_USE_EXPERIMENTAL_INTERFACES -DPEGASUS_USE_DEPRECATED_INTERFACES -DPEGASUS_ENABLE_CMPI_PROVIDER_MANAGER -DPEGASUS_DEST_LIB_DIR="lib" -DPLATFORM_COMPONENT_NAME="pegcommon" -I/opt/pegDailyBuild/builddir/icu/source/common -I/opt/pegDailyBuild/builddir/icu/source/i18n -I/usr/include -I/opt/NightlyBuild/pegasusbuild/pegasus/src Executor.cpp
In file included from Executor.cpp:55:
/opt/NightlyBuild/pegasusbuild/pegasus/src/Pegasus/Common/Mutex.h:167:28: error: missing ')' in expression
make[3]: *** [/opt/NightlyBuild/pegasusbuild/runtime/obj/Pegasus/Common/Executor.o] Error 1
make[3]: Leaving directory `/opt/NightlyBuild/pegasusbuild/pegasus/src/Pegasus/Common'
make[2]: *** [all] Error 2
make[2]: Leaving directory `/opt/NightlyBuild/pegasusbuild/pegasus/src/Pegasus'
make[1]: *** [all] Error 2
make[1]: Leaving directory `/opt/NightlyBuild/pegasusbuild/pegasus/src'
make: *** [all] Error 2