OpenPegasus Nightly Build & Regression Testing Status

Platform Report

Return to Index

Platform LINUX_ZSERIES64_GNU_(RHEL5)(+CMPI_+ICU_+SSL)
Branch RELEASE_2_8-BRANCH
Options +CMPI,+ICU,+SSL
Date 12-Dec-09 19:30
Contributor IBM
Status FAILURE
Data Platform: LINUX_ZSERIES64_GNU (RHEL5)(+CMPI +ICU +SSL)
Branch: RELEASE_2_8-branch
Date: 091212
Time: 1930 GMT
Contributor: IBM
Options: +CMPI +ICU +SSL
Status:FAILURE
==================================================================
NI thread 3: iteration 4: received 4004 inst names, et 42.2141 of 60
NI thread 2: iteration 5: received 4004 inst names, et 44.0303 of 60
NI thread 2: iteration 6: received 4004 inst names, et 48.3974 of 60
NI thread 3: iteration 5: received 4004 inst names, et 47.7295 of 60
EI thread 0: iteration 3: received 4004 instances, et 52.1042 of 60
EI thread 1: iteration 3: received 4004 instances, et 54.7303 of 60
NI thread 3: iteration 6: received 4004 inst names, et 57.306 of 60
NI thread 2: iteration 7: received 4004 inst names, et 59.4459 of 60
NI thread 2: iteration 8: received 4004 inst names, et 64.0746 of 60
+++++ NI thread 2: passed in 64.0746 seconds with 8 iterations
NI thread 3: iteration 7: received 4004 inst names, et 63.9647 of 60
+++++ NI thread 3: passed in 63.9647 seconds with 7 iterations
EI thread 1: iteration 4: received 4004 instances, et 70.7264 of 60
+++++ EI thread 1: passed in 70.7264 seconds with 4 iterations
EI thread 0: iteration 4: received 4004 instances, et 71.0334 of 60
+++++ EI thread 0: passed in 71.0334 seconds with 4 iterations
Expected Results: 24
Actual Results : 23
---- failed tests
make[5]: *** [poststarttests] Error 1
make[5]: Leaving directory `/opt/NightlyBuild/pegasus28/pegasus/src/Providers/TestProviders/ChunkingStressProvider/testclient'
make[4]: *** [poststarttests] Error 2
make[4]: Leaving directory `/opt/NightlyBuild/pegasus28/pegasus/src/Providers/TestProviders'
make[3]: *** [poststarttests] Error 2
make[3]: Leaving directory `/opt/NightlyBuild/pegasus28/pegasus/src/Providers'
make[2]: *** [poststarttests] Error 2
make[2]: Leaving directory `/opt/NightlyBuild/pegasus28/pegasus/src'
make[1]: *** [poststarttests] Error 2
make[1]: Leaving directory `/opt/NightlyBuild/pegasus28/pegasus'
make: *** [serversuite] Error 2
==================================================================