OpenPegasus Nightly Build & Regression Testing Status

Platform Report

Return to Index

Platform IA64_SLES9
Branch RELEASE_2_8-BRANCH
Options +CMPI,+CQL,+IPV6,+PRIVSEP,+SSL,+WSMAN
Date 26-Aug-10 21:16
Contributor HP
Status FAILURE
Data Platform: IA64 SLES9
Branch: RELEASE_2_8-branch
Contributor: HP
Date: 100826
Time: 2116
Options: +CMPI +CQL +IPv6 +PrivSep +SSL +WSMan
Status: FAILURE

> Handler: test/CimsubTestNS0:CIM_ListenerDestinationCIMXML.Handler15
> Query: "SELECT * FROM CIM_ProcessIndication"
> Destination: localhost/CIMListener/test7
> SubscriptionState: Disabled
> -----------------------------------------
make[7]: *** [poststarttests] Error 1
make[7]: Leaving directory `/var/build2.8/pegasus/src/Clients/cimsub/tests/testscript'
make[6]: *** [poststarttests] Error 2
make[6]: Leaving directory `/var/build2.8/pegasus/src/Clients/cimsub/tests'
make[5]: *** [poststarttests] Error 2
make[5]: Leaving directory `/var/build2.8/pegasus/src/Clients'
make[4]: *** [poststarttests] Error 2
make[4]: Leaving directory `/var/build2.8/pegasus/src'
make[3]: *** [poststarttests] Error 2
make[3]: Leaving directory `/var/build2.8/pegasus'
make[2]: *** [runTestSuite] Error 2
make[2]: Leaving directory `/var/build2.8/pegasus'
make[1]: *** [run_OOP_TS1] Error 2
make[1]: Leaving directory `/var/build2.8/pegasus'
make: *** [serversuite] Error 2