OpenPegasus Nightly Build & Regression Testing Status

Platform Report

Return to Index

Platform IA32_SLES10
Branch MAIN
Options +CMPI,+CQL,+IPV6,+PRIVSEP,+SQLITE,+SSL,+WSMAN
Date 25-Oct-10 16:32
Contributor HP
Status FAILURE
Data Platform: IA32 SLES10
Branch: MAIN
Contributor: HP
Date: 101025
Time: 1632
Options: +CMPI +CQL +IPv6 +PrivSep +SQLite +SSL +WSMan
Status: FAILURE

make[4]: Leaving directory `/disk1/buildMAIN/pegasus/src/Executor/tests'
make[3]: Leaving directory `/disk1/buildMAIN/pegasus/src'
make[3]: Entering directory `/disk1/buildMAIN/pegasus/test'
make[4]: Entering directory `/disk1/buildMAIN/pegasus/test/wetest'
make[5]: Entering directory `/disk1/buildMAIN/pegasus/test/wetest/cimv2'
make[5]: Leaving directory `/disk1/buildMAIN/pegasus/test/wetest/cimv2'
make[5]: Entering directory `/disk1/buildMAIN/pegasus/test/wetest/static'
make[5]: Leaving directory `/disk1/buildMAIN/pegasus/test/wetest/static'
make[5]: Entering directory `/disk1/buildMAIN/pegasus/test/wetest/wsman'
make[5]: Leaving directory `/disk1/buildMAIN/pegasus/test/wetest/wsman'
make[4]: Leaving directory `/disk1/buildMAIN/pegasus/test/wetest'
make[3]: Leaving directory `/disk1/buildMAIN/pegasus/test'
make[2]: Leaving directory `/disk1/buildMAIN/pegasus'
make[1]: Leaving directory `/disk1/buildMAIN/pegasus'
make[1]: Entering directory `/disk1/buildMAIN/pegasus'
*** One or more core files found. ***
/var/buildMAIN/pegasus/build/tmp/core.30146 /var/buildMAIN/pegasus/build/tmp/core.8895
make[1]: *** [check_core_search_results] Error 1
make[1]: Leaving directory `/disk1/buildMAIN/pegasus'
make: *** [check_for_cores] Error 2

1288025630s-30674us: DiscardedData [30146:2471345056:IndicationService.cpp:3081]: Exception caught in attempting to process indication for the subscription root/PG_InterOp:CIM_IndicationSubscription.Filter="CIM_IndicationFilter.CreationClassName="CIM_IndicationFilter",Name="TestCMPI_Indication_Filter_2",SystemCreationClassName="CIM_ComputerSystem",SystemName="dctxvm28.ind.hp.com"",Handler="CIM_IndicationHandlerCIMXML.CreationClassName="CIM_IndicationHandlerCIMXML",Name="TestCMPI_Indication_Handler_2",SystemCreationClassName="CIM_ComputerSystem",SystemName="dctxvm28.ind.hp.com"": type mismatch
1288025630s-31245us: DiscardedData [30146:2471345056:IndicationService.cpp:3081]: Exception caught in attempting to process indication for the subscription root/PG_InterOp:CIM_IndicationSubscription.Filter="CIM_IndicationFilter.CreationClassName="CIM_IndicationFilter",Name="TestCMPI_Indication_Filter_2",SystemCreationClassName="CIM_ComputerSystem",SystemName="dctxvm28.ind.hp.com"",Handler="CIM_IndicationHandlerCIMXML.CreationClassName="CIM_IndicationHandlerCIMXML",Name="TestCMPI_Indication_Handler_2",SystemCreationClassName="CIM_ComputerSystem",SystemName="dctxvm28.ind.hp.com"": type mismatch
1288025630s-31717us: DiscardedData [30146:2471345056:IndicationService.cpp:3081]: Exception caught in attempting to process indication for the subscription root/PG_InterOp:CIM_IndicationSubscription.Filter="CIM_IndicationFilter.CreationClassName="CIM_IndicationFilter",Name="TestCMPI_Indication_Filter_2",SystemCreationClassName="CIM_ComputerSystem",SystemName="dctxvm28.ind.hp.com"",Handler="CIM_IndicationHandlerCIMXML.CreationClassName="CIM_IndicationHandlerCIMXML",Name="TestCMPI_Indication_Handler_2",SystemCreationClassName="CIM_ComputerSystem",SystemName="dctxvm28.ind.hp.com"": type mismatch
1288025632s-41500us: DiscardedData [30146:2597235616:IndicationService.cpp:3081]: Exception caught in attempting to process indication for the subscription root/PG_InterOp:CIM_IndicationSubscription.Filter="CIM_IndicationFilter.CreationClassName="CIM_IndicationFilter",Name="TestCMPI_Indication_Filter_4",SystemCreationClassName="CIM_ComputerSystem",SystemName="dctxvm28.ind.hp.com"",Handler="CIM_IndicationHandlerCIMXML.CreationClassName="CIM_IndicationHandlerCIMXML",Name="TestCMPI_Indication_Handler_4",SystemCreationClassName="CIM_ComputerSystem",SystemName="dctxvm28.ind.hp.com"": type mismatch
1288026273s-21344us: DiscardedData [8895:2504899488:IndicationService.cpp:3081]: Exception caught in attempting to process indication for the subscription root/PG_InterOp:CIM_IndicationSubscription.Filter="CIM_IndicationFilter.CreationClassName="CIM_IndicationFilter",Name="TestCMPI_Indication_Filter_2",SystemCreationClassName="CIM_ComputerSystem",SystemName="dctxvm28.ind.hp.com"",Handler="CIM_IndicationHandlerCIMXML.CreationClassName="CIM_IndicationHandlerCIMXML",Name="TestCMPI_Indication_Handler_2",SystemCreationClassName="CIM_ComputerSystem",SystemName="dctxvm28.ind.hp.com"": type mismatch
1288026273s-21856us: DiscardedData [8895:2504899488:IndicationService.cpp:3081]: Exception caught in attempting to process indication for the subscription root/PG_InterOp:CIM_IndicationSubscription.Filter="CIM_IndicationFilter.CreationClassName="CIM_IndicationFilter",Name="TestCMPI_Indication_Filter_2",SystemCreationClassName="CIM_ComputerSystem",SystemName="dctxvm28.ind.hp.com"",Handler="CIM_IndicationHandlerCIMXML.CreationClassName="CIM_IndicationHandlerCIMXML",Name="TestCMPI_Indication_Handler_2",SystemCreationClassName="CIM_ComputerSystem",SystemName="dctxvm28.ind.hp.com"": type mismatch
1288026273s-22267us: DiscardedData [8895:2504899488:IndicationService.cpp:3081]: Exception caught in attempting to process indication for the subscription root/PG_InterOp:CIM_IndicationSubscription.Filter="CIM_IndicationFilter.CreationClassName="CIM_IndicationFilter",Name="TestCMPI_Indication_Filter_2",SystemCreationClassName="CIM_ComputerSystem",SystemName="dctxvm28.ind.hp.com"",Handler="CIM_IndicationHandlerCIMXML.CreationClassName="CIM_IndicationHandlerCIMXML",Name="TestCMPI_Indication_Handler_2",SystemCreationClassName="CIM_ComputerSystem",SystemName="dctxvm28.ind.hp.com"": type mismatch
1288026275s-58495us: DiscardedData [8895:2597219232:IndicationService.cpp:3081]: Exception caught in attempting to process indication for the subscription root/PG_InterOp:CIM_IndicationSubscription.Filter="CIM_IndicationFilter.CreationClassName="CIM_IndicationFilter",Name="TestCMPI_Indication_Filter_4",SystemCreationClassName="CIM_ComputerSystem",SystemName="dctxvm28.ind.hp.com"",Handler="CIM_IndicationHandlerCIMXML.CreationClassName="CIM_IndicationHandlerCIMXML",Name="TestCMPI_Indication_Handler_4",SystemCreationClassName="CIM_ComputerSystem",SystemName="dctxvm28.ind.hp.com"": type mismatch
n*********** FAILURE: Unexpected trace found. ************n