OpenPegasus Nightly Build & Regression Testing Status

Platform Report

Return to Index

Platform X86_64_RHEL5_RPM
Branch RELEASE_2_8-BRANCH
Options  
Date 01-Apr-11 14:40
Contributor HP
Status FAILURE
Data Platform: X86_64 RHEL5 RPM
Branch: RELEASE_2_8-branch
Contributor: HP
Date: 110401
Time: 1440
Status: FAILURE

D: read h# 1237 Header V3 DSA signature: NOKEY, key ID 37017186
D: Requires: pam-devel YES (db provides)
D: read h# 944 Header V3 DSA signature: NOKEY, key ID 37017186
D: Requires: openssl-devel >= 0.9.6 YES (db provides)
D: read h# 402 Header V3 DSA signature: NOKEY, key ID 37017186
D: Requires: e2fsprogs YES (db provides)
D: read h# 1435 Header V3 DSA signature: NOKEY, key ID 37017186
D: Requires: net-snmp-devel YES (db provides)
D: read h# 7592 Header SHA1 digest: OK (3def37916987c2ada2c4d6e7fa03d37db147596b)
D: Conflicts: tog-pegasus YES (db provides)
D: package tog-pegasus-2.8.3-1.x86_64 has unsatisfied Conflicts: tog-pegasus
D: closed db index /var/lib/rpm/Pubkeys
D: closed db index /var/lib/rpm/Depends
D: closed db index /var/lib/rpm/Providename
D: closed db index /var/lib/rpm/Packages
D: closed db environment /var/lib/rpm/Packages
error: Failed build dependencies:
tog-pegasus conflicts with tog-pegasus-2.8.3-1.x86_64
D: May free Score board((nil))
make: *** [createSRCRPM] Error 1