OpenPegasus Nightly Build & Regression Testing Status

Platform Report

Return to Index

Platform IA64_SLES9
Branch RELEASE_2_9-BRANCH
Options +CMPI,+CQL,+IPV6,+PRIVSEP,+SQLITE,+SSL,+WSMAN
Date 19-Sep-11 21:17
Contributor HP
Status FAILURE
Data Platform: IA64 SLES9
Branch: RELEASE_2_9-branch
Contributor: HP
Date: 110919
Time: 2117
Options: +CMPI +CQL +IPv6 +PrivSep +SQLite +SSL +WSMan
Status: FAILURE

TestIndicationStressTest IndicationStressTestClass test/TestProvider cleanup
++++ Testing with class IndicationStressTestClass and Namespace test/TestProvider
connection timed out
make[8]: *** [cql_10_1] Error 255
make[8]: Leaving directory `/var/build2.9/pegasus/src/Providers/TestProviders/IndicationStressTestProvider/testclient'
make[7]: *** [poststarttests2] Error 2
make[7]: Leaving directory `/var/build2.9/pegasus/src/Providers/TestProviders/IndicationStressTestProvider/testclient'
make[6]: *** [poststarttests] Error 2
make[6]: Leaving directory `/var/build2.9/pegasus/src/Providers/TestProviders/IndicationStressTestProvider/testclient'
make[5]: *** [poststarttests] Error 2
make[5]: Leaving directory `/var/build2.9/pegasus/src/Providers/TestProviders'
make[4]: *** [poststarttests] Error 2
make[4]: Leaving directory `/var/build2.9/pegasus/src/Providers'
make[3]: *** [poststarttests] Error 2
make[3]: Leaving directory `/var/build2.9/pegasus/src'
make[2]: *** [poststarttests] Error 2
make[2]: Leaving directory `/var/build2.9/pegasus'
make[1]: *** [TestBinRepo] Error 2
make[1]: Leaving directory `/var/build2.9/pegasus'
make: *** [serversuite] Error 2

1316476842s-521228us: DiscardedData [22683:2305843009301100736:HTTPConnection.cpp:885]: Socket write failed with error 32; could not write response to client. (Client may have timed out.)
n*********** FAILURE: Unexpected trace found. ************n