OpenPegasus Nightly Build & Regression Testing Status

Platform Report

Return to Index

Platform HP-UX_11iv3_Integrity
Branch MAIN
Options +CMPI,+CQL,+IPV6,+PRIVSEP,+SLP,+SQLITE,+SSL,+WSMAN
Date 25-Mar-12 22:06
Contributor HP
Status FAILURE
Data Platform: HP-UX 11iv3 Integrity
Branch: MAIN
Contributor: HP
Date: 120325
Time: 2206
Options: +CMPI +CQL +IPv6 +PrivSep +SLP +SQLite +SSL +WSMan
Status: FAILURE

make[4]: `/var/buildMAIN/pegasus/build/bin/stripline' is up to date.
make[4]: Leaving directory `/data/buildMAIN/pegasus/src/utils/stripline'
make[4]: Entering directory `/data/buildMAIN/pegasus/src/utils/stripcrs'
make[4]: `/var/buildMAIN/pegasus/build/bin/stripcrs' is up to date.
make[4]: Leaving directory `/data/buildMAIN/pegasus/src/utils/stripcrs'
make[3]: Leaving directory `/data/buildMAIN/pegasus/src/utils'
make[3]: Entering directory `/data/buildMAIN/pegasus/src/Pegasus'
make[4]: Entering directory `/data/buildMAIN/pegasus/src/Pegasus/Common'
aCC -b -Wl,+hlibpegcommon.1 +DD64 -mt -Wl,+rpathfirst -Wl,+b/var/buildMAIN/pegasus/build/lib:/usr/lib -Wl,+s -g +noobjdebug -L/var/buildMAIN/pegasus/build/lib -o /var/buildMAIN/pegasus/build/lib/libpegcommon.1 /var/buildMAIN/pegasus/build/obj/Pegasus/Common/SCMO.o /var/buildMAIN/pegasus/build/obj/Pegasus/Common/SCMOXmlWriter.o /var/buildMAIN/pegasus/build/obj/Pegasus/Common/SCMOClassCache.o /var/buildMAIN/pegasus/build/obj/Pegasus/Common/SCMOStreamer.o /var/buildMAIN/pegasus/build/obj/Pegasus/Common/Print.o /var/buildMAIN/pegasus/build/obj/Pegasus/Common/Executor.o /var/buildMAIN/pegasus/build/obj/Pegasus/Common/Once.o /var/buildMAIN/pegasus/build/obj/Pegasus/Common/Time.o /var/buildMAIN/pegasus/build/obj/Pegasus/Common/Threads.o /var/buildMAIN/pegasus/build/obj/Pegasus/Common/TSDKey.o /var/buildMAIN/pegasus/build/obj/Pegasus/Common/Semaphore.o /var/buildMAIN/pegasus/build/obj/Pegasus/Common/ReadWriteSem.o /var/buildMAIN/pegasus/build/obj/Pegasus/Common/Condition.o /var/buil
dMAIN/pegasus/build/obj/Pegasus/Common/AnonymousPipe.o /var/buildMAIN/pegasus/build/obj/Pegasus/Common/Array.o /var/buildMAIN/pegasus/build/obj/Pegasus/Common/AsyncOpNode.o /var/buildMAIN/pegasus/build/obj/Pegasus/Common/AtomicInt.o /var/buildMAIN/pegasus/build/obj/Pegasus/Common/AuthenticationInfoRep.o /var/buildMAIN/pegasus/build/obj/Pegasus/Common/Base64.o /var/buildMAIN/pegasus/build/obj/Pegasus/Common/Buffer.o /var/buildMAIN/pegasus/build/obj/Pegasus/Common/CharSet.o /var/buildMAIN/pegasus/build/obj/Pegasus/Common/LanguageParser.o /var/buildMAIN/pegasus/build/obj/Pegasus/Common/AcceptLanguageList.o /var/buildMAIN/pegasus/build/obj/Pegasus/Common/ContentLanguageList.o /var/buildMAIN/pegasus/build/obj/Pegasus/Common/LanguageTag.o /var/buildMAIN/pegasus/build/obj/Pegasus/Common/MessageLoader.o /var/buildMAIN/pegasus/build/obj/Pegasus/Common/Char16Inline.o /var/buildMAIN/pegasus/build/obj/Pegasus/Common/CIMClass.o /var/buildMAIN/pegasus/build/obj/Pegasus/Common/CIMClassRep.
o /var/buildMAIN/pegasus/build/obj/Pegasus/Common/CIMDateTim!
e.o /
ld: I/O error, file "/var/buildMAIN/pegasus/build/lib/libpegcommon.1": Text file busy
Fatal error.
make[4]: *** [/var/buildMAIN/pegasus/build/lib/libpegcommon.1] Error 1
make[4]: Leaving directory `/data/buildMAIN/pegasus/src/Pegasus/Common'
make[3]: *** [all] Error 2
make[3]: Leaving directory `/data/buildMAIN/pegasus/src/Pegasus'
make[2]: *** [all] Error 2
make[2]: Leaving directory `/data/buildMAIN/pegasus/src'
make[1]: *** [all] Error 2
make[1]: Leaving directory `/data/buildMAIN/pegasus'
make: *** [build] Error 2
Status: FAILURE

Status: FAILURE

Status: FAILURE

make[4]: `/var/buildMAIN/pegasus/build/bin/stripline' is up to date.
make[4]: Leaving directory `/data/buildMAIN/pegasus/src/utils/stripline'
make[4]: Entering directory `/data/buildMAIN/pegasus/src/utils/stripcrs'
make[4]: `/var/buildMAIN/pegasus/build/bin/stripcrs' is up to date.
make[4]: Leaving directory `/data/buildMAIN/pegasus/src/utils/stripcrs'
make[3]: Leaving directory `/data/buildMAIN/pegasus/src/utils'
make[3]: Entering directory `/data/buildMAIN/pegasus/src/Pegasus'
make[4]: Entering directory `/data/buildMAIN/pegasus/src/Pegasus/Common'
aCC -b -Wl,+hlibpegcommon.1 +DD64 -mt -Wl,+rpathfirst -Wl,+b/var/buildMAIN/pegasus/build/lib:/usr/lib -Wl,+s -g +noobjdebug -L/var/buildMAIN/pegasus/build/lib -o /var/buildMAIN/pegasus/build/lib/libpegcommon.1 /var/buildMAIN/pegasus/build/obj/Pegasus/Common/SCMO.o /var/buildMAIN/pegasus/build/obj/Pegasus/Common/SCMOXmlWriter.o /var/buildMAIN/pegasus/build/obj/Pegasus/Common/SCMOClassCache.o /var/buildMAIN/pegasus/build/obj/Pegasus/Common/SCMOStreamer.o /var/buildMAIN/pegasus/build/obj/Pegasus/Common/Print.o /var/buildMAIN/pegasus/build/obj/Pegasus/Common/Executor.o /var/buildMAIN/pegasus/build/obj/Pegasus/Common/Once.o /var/buildMAIN/pegasus/build/obj/Pegasus/Common/Time.o /var/buildMAIN/pegasus/build/obj/Pegasus/Common/Threads.o /var/buildMAIN/pegasus/build/obj/Pegasus/Common/TSDKey.o /var/buildMAIN/pegasus/build/obj/Pegasus/Common/Semaphore.o /var/buildMAIN/pegasus/build/obj/Pegasus/Common/ReadWriteSem.o /var/buildMAIN/pegasus/build/obj/Pegasus/Common/Condition.o /var/buil
dMAIN/pegasus/build/obj/Pegasus/Common/AnonymousPipe.o /var/buildMAIN/pegasus/build/obj/Pegasus/Common/Array.o /var/buildMAIN/pegasus/build/obj/Pegasus/Common/AsyncOpNode.o /var/buildMAIN/pegasus/build/obj/Pegasus/Common/AtomicInt.o /var/buildMAIN/pegasus/build/obj/Pegasus/Common/AuthenticationInfoRep.o /var/buildMAIN/pegasus/build/obj/Pegasus/Common/Base64.o /var/buildMAIN/pegasus/build/obj/Pegasus/Common/Buffer.o /var/buildMAIN/pegasus/build/obj/Pegasus/Common/CharSet.o /var/buildMAIN/pegasus/bmake[4]: `/var/buildMAIN/pegasus/build/bin/stripline' is up to date.
make[4]: Leaving directory `/data/buildMAIN/pegasus/src/utils/stripline'
make[4]: Entering directory `/data/buildMAIN/pegasus/src/utils/stripcrs'
make[4]: `/var/buildMAIN/pegasus/build/bin/stripcrs' is up to date.
make[4]: Leaving directory `/data/buildMAIN/pegasus/src/utils/stripcrs'
make[3]: Leaving directory `/data/buildMAIN/pegasus/src/utils'
make[3]: Entering directory `/data/buildMAIN/pegasus/src/Pegasus'
make[4]: Entering directory `/data/buildMAIN/pegasus/src/Pegasus/Common'
aCC -b -Wl,+hlibpegcommon.1 +DD64 -mt -Wl,+rpathfirst -Wl,+b/var/buildMAIN/pegasus/build/lib:/usr/lib -Wl,+s -g +noobjdebug -L/var/buildMAIN/pegasus/build/lib -o /var/buildMAIN/pegasus/build/lib/libpegcommon.1 /var/buildMAIN/pegasus/build/obj/Pegasus/Common/SCMO.o /var/buildMAIN/pegasus/build/obj/Pegasus/Common/SCMOXmlWriter.o /var/buildMAIN/pegasus/build/obj/Pegasus/Common/SCMOClassCache.o /var/buildMAIN/pegasus/build/obj/Pegasus/Common/SCMOStreamer.o /var/buildMAIN/pegasus/build/obj/Pegasus/Common/Print.o /var/buildMAIN/pegasus/build/obj/Pegasus/Common/Executor.o /var/buildMAIN/pegasus/build/obj/Pegasus/Common/Once.o /var/buildMAIN/pegasus/build/obj/Pegasus/Common/Time.o /var/buildMAIN/pegasus/build/obj/Pegasus/Common/Threads.o /var/buildMAIN/pegasus/build/obj/Pegasus/Common/TSDKey.o /var/buildMAIN/pegasus/build/obj/Pegasus/Common/Semaphore.o /var/buildMAIN/pegasus/build/obj/Pegasus/Common/ReadWriteSem.o /var/buildMAIN/pegasus/build/obj/Pegasus/Common/Condition.o /var/buil
dMAIN/pegasus/build/obj/Pegasus/Common/AnonymousPipe.o /var/buildMAIN/pegasus/build/obj/Pegasus/Common/Array.o /var/buildMAIN/pegasus/build/obj/Pegasus/Common/AsyncOpNode.o /var/buildMAIN/pegasus/build/obj/Pegasus/Common/AtomicInt.o /var/buildMAIN/pegasus/build/obj/Pegasus/Common/AuthenticationInfoRep.o /var/buildMAIN/pegasus/build/obj/Pegasus/Common/Base64.o /var/buildMAIN/pegasus/build/obj/Pegasus/Common/Buffer.o /var/buildMAIN/pegasus/build/obj/Pegasus/Common/CharSet.o /var/buildMAIN/pegasus/bmake[4]: `/var/buildMAIN/pegasus/build/bin/stripline' is up to date.
make[4]: Leaving directory `/data/buildMAIN/pegasus/src/utils/stripline'
make[4]: Entering directory `/data/buildMAIN/pegasus/src/utils/stripcrs'
make[4]: `/var/buildMAIN/pegasus/build/bin/stripcrs' is up to date.
make[4]: Leaving directory `/data/buildMAIN/pegasus/src/utils/stripcrs'
make[3]: Leaving directory `/data/buildMAIN/pegasus/src/utils'
make[3]: Entering directory `/data/buildMAIN/pegasus/src/Pegasus'
make[4]: Entering directory `/data/buildMAIN/pegasus/src/Pegasus/Common'
aCC -b -Wl,+hlibpegcommon.1 +DD64 -mt -Wl,+rpathfirst -Wl,+b/var/buildMAIN/pegasus/build/lib:/usr/lib -Wl,+s -g +noobjdebug -L/var/buildMAIN/pegasus/build/lib -o /var/buildMAIN/pegasus/build/lib/libpegcommon.1 /var/buildMAIN/pegasus/build/obj/Pegasus/Common/SCMO.o /var/buildMAIN/pegasus/build/obj/Pegasus/Common/SCMOXmlWriter.o /var/buildMAIN/pegasus/build/obj/Pegasus/Common/SCMOClassCache.o /var/buildMAIN/pegasus/build/obj/Pegasus/Common/SCMOStreamer.o /var/buildMAIN/pegasus/build/obj/Pegasus/Common/Print.o /var/buildMAIN/pegasus/build/obj/Pegasus/Common/Executor.o /var/buildMAIN/pegasus/build/obj/Pegasus/Common/Once.o /var/buildMAIN/pegasus/build/obj/Pegasus/Common/Time.o /var/buildMAIN/pegasus/build/obj/Pegasus/Common/Threads.o /var/buildMAIN/pegasus/build/obj/Pegasus/Common/TSDKey.o /var/buildMAIN/pegasus/build/obj/Pegasus/Common/Semaphore.o /var/buildMAIN/pegasus/build/obj/Pegasus/Common/ReadWriteSem.o /var/buildMAIN/pegasus/build/obj/Pegasus/Common/Condition.o /var/buil
dMAIN/pegasus/build/obj/Pegasus/Common/AnonymousPipe.o /var/buildMAIN/pegasus/build/obj/Pegasus/Common/Array.o /var/buildMAIN/pegasus/build/obj/Pegasus/Common/AsyncOpNode.o /var/buildMAIN/pegasus/build/obj/Pegasus/Common/AtomicInt.o /var/buildMAIN/pegasus/build/obj/Pegasus/Common/AuthenticationInfoRep.o /var/buildMAIN/pegasus/build/obj/Pegasus/Common/Base64.o /var/buildMAIN/pegasus/build/obj/Pegasus/Common/Buffer.o /var/buildMAIN/pegasus/build/obj/Pegasus/Common/CharSet.o /var/buildMAIN/pegasus/build/obj/Pegasus/Common/LanguageParser.o /var/buildMAIN/pegasus/build/obj/Pegasus/Common/AcceptLanguageList.o /var/buildMAIN/pegasus/build/obj/Pegasus/Common/ContentLanguageList.o /var/buildMAIN/pegasus/build/obj/Pegasus/Common/LanguageTag.o /var/buildMAIN/pegasus/build/obj/Pegasus/Common/MessageLoader.o /var/buildMAIN/pegasus/build/obj/Pegasus/Common/Char16Inline.o /var/buildMAIN/pegasus/build/obj/Pegasus/Common/CIMClass.o /var/buildMAIN/pegasus/build/obj/Pegasus/Common/CIMClassRep.
o /var/buildMAIN/pegasus/build/obj/Pegasus/Common/CIMDateTim!
e.o /
ld: I/O error, file "/var/buildMAIN/pegasus/build/lib/libpegcommon.1": Text file busy
Fatal error.
make[4]: *** [/var/buildMAIN/pegasus/build/lib/libpegcommon.1] Error 1
make[4]: Leaving directory `/data/buildMAIN/pegasus/src/Pegasus/Common'
make[3]: *** [all] Error 2
make[3]: Leaving directory `/data/buildMAIN/pegasus/src/Pegasus'
make[2]: *** [all] Error 2
make[2]: Leaving directory `/data/buildMAIN/pegasus/src'
make[1]: *** [all] Error 2
make[1]: Leaving directory `/data/buildMAIN/pegasus'
make: *** [build] Error 2
uild/obj/Pegasus/Common/LanguageParser.o /var/buildMAIN/pegasus/build/obj/Pegasus/Common/AcceptLanguageList.o /var/buildMAIN/pegasus/build/obj/Pegasus/Common/ContentLanguageList.o /var/buildMAIN/pegasus/build/obj/Pegasus/Common/LanguageTag.o /var/buildMAIN/pegasus/build/obj/Pegasus/Common/MessageLoader.o /var/buildMAIN/pegasus/build/obj/Pegasus/Common/Char16Inline.o /var/buildMAIN/pegasus/build/obj/Pegasus/Common/CIMClass.o /var/buildMAIN/pegasus/build/obj/Pegasus/Common/CIMClassRep.o /var/buildMAIN/pegasus/build/obj/Pegasus/Common/CIMDateTime.o /var/buildMAIN/pegasus/build/obj/Pegasus/Common/CIMFlavor.o /var/buildMAIN/pegasus/build/obj/Pegasus/Common/CIMInstance.o /var/buildMAIN/pegasus/build/obj/Pegasus/Common/CIMInstanceRep.o /var/buildMAIN/pegasus/build/obj/Pegasus/Common/CIMMessage.o /var/buildMAIN/pegasus/build/obj/Pegasus/Common/CIMResponseData.o /var/buildMAIN/pegasus/build/obj/Pegasus/Common/CIMMethod.o /var/buildMAIN/pegasus/build/obj/Pegasus/Common/CIMMethodRep.o /
var/buildMAIN/pegasus/build/obj/Pegasus/Common/CIMName.o /var/buildMAIN/pegasus/build/obj/Pegasus/Common/CIMNameInline.o /var/buildMAIN/pegasus/build/obj/Pegasus/Common/CIMObject.o /var/buildMAIN/pegasus/build/obj/Pegasus/Common/CIMObjectRep.o /var/buildMAIN/pegasus/build/obj/Pegasus/Common/CIMObjectPath.o /var/buildMAIN/pegasus/build/obj/Pegasus/Common/Cimom.o /var/buildMAIN/pegasus/build/obj/Pegasus/Common/CimomMessage.o /var/buildMAIN/pegasus/build/obj/Pegasus/Common/CIMParameter.o /var/buildMAIN/pegasus/build/obj/Pegasus/Common/CIMParameterRep.o /var/buildMAIN/pegasus/build/obj/Pegasus/Common/CIMParamValue.o /var/buildMAIN/pegasus/build/obj/Pegasus/Common/CIMParamValueRep.o /var/buildMAIN/pegasus/build/obj/Pegasus/Common/CIMProperty.o /var/buildMAIN/pegasus/build/obj/Pegasus/Common/CIMPropertyList.o /var/buildMAIN/pegasus/build/obj/Pegasus/Common/CIMPropertyRep.o /var/buildMAIN/pegasus/build/obj/Pegasus/Common/CIMQualifier.o /var/buildMAIN/pegasus/build/obj/Pegasus/Commo
n/CIMQualifierDecl.o /var/buildMAIN/pegasus/build/obj/Pegasu!
s/Com
ld: I/O error, file "/var/buildMAIN/pegasus/build/lib/libpegcommon.1": Text file busy
Fatal error.
make[4]: *** [/var/buildMAIN/pegasus/build/lib/libpegcommon.1] Error 1
make[4]: Leaving directory `/data/buildMAIN/pegasus/src/Pegasus/Common'
make[3]: *** [all] Error 2
make[3]: Leaving directory `/data/buildMAIN/pegasus/src/Pegasus'
make[2]: *** [all] Error 2
make[2]: Leaving directory `/data/buildMAIN/pegasus/src'
make[1]: *** [all] Error 2
make[1]: Leaving directory `/data/buildMAIN/pegasus'
make: *** [build] Error 2
uild/obj/Pegasus/Common/LanguageParser.o /var/buildMAIN/pegasus/build/obj/Pegasus/Common/AcceptLanguageList.o /var/buildMAIN/pegasus/build/obj/Pegasus/Common/ContentLanguageList.o /var/buildMAIN/pegasus/build/obj/Pegasus/Common/LanguageTag.o /var/buildMAIN/pegasus/build/obj/Pegasus/Common/MessageLoader.o /var/buildMAIN/pegasus/build/obj/Pegasus/Common/Char16Inline.o /var/buildMAIN/pegasus/build/obj/Pegasus/Common/CIMClass.o /var/buildMAIN/pegasus/build/obj/Pegasus/Common/CIMClassRep.o /var/buildMAIN/pegasus/build/obj/Pegasus/Common/CIMDateTime.o /var/buildMAIN/pegasus/build/obj/Pegasus/Common/CIMFlavor.o /var/buildMAIN/pegasus/build/obj/Pegasus/Common/CIMInstance.o /var/buildMAIN/pegasus/build/obj/Pegasus/Common/CIMInstanceRep.o /var/buildMAIN/pegasus/build/obj/Pegasus/Common/CIMMessage.o /var/buildMAIN/pegasus/build/obj/Pegasus/Common/CIMResponseData.o /var/buildMAIN/pegasus/build/obj/Pegasus/Common/CIMMethod.o /var/buildMAIN/pegasus/build/obj/Pegasus/Common/CIMMethodRep.o /
var/buildMAIN/pegasus/build/obj/Pegasus/Common/CIMName.o /var/buildMAIN/pegasus/build/obj/Pegasus/Common/CIMNameInline.o /var/buildMAIN/pegasus/build/obj/Pegasus/Common/CIMObject.o /var/buildMAIN/pegasus/build/obj/Pegasus/Common/CIMObjectRep.o /var/buildMAIN/pegasus/build/obj/Pegasus/Common/CIMObjectPath.o /var/buildMAIN/pegasus/build/obj/Pegasus/Common/Cimom.o /var/buildMAIN/pegasus/build/obj/Pegasus/Common/CimomMessage.o /var/buildMAIN/pegasus/build/obj/Pegasus/Common/CIMParameter.o /var/buildMAIN/pegasus/build/obj/Pegasus/Common/CIMParameterRep.o /var/buildMAIN/pegasus/build/obj/Pegasus/Common/CIMParamValue.o /var/buildMAIN/pegasus/build/obj/Pegasus/Common/CIMParamValueRep.o /var/buildMAIN/pegasus/build/obj/Pegasus/Common/CIMProperty.o /var/buildMAIN/pegasus/build/obj/Pegasus/Common/CIMPropertyList.o /var/buildMAIN/pegasus/build/obj/Pegasus/Common/CIMPropertyRep.o /var/buildMAIN/pegasus/build/obj/Pegasus/Common/CIMQualifier.o /var/buildMAIN/pegasus/build/obj/Pegasus/Commo
n/CIMQualifierDecl.o /var/buildMAIN/pegasus/build/obj/Pegasu!
s/Com
ld: I/O error, file "/var/buildMAIN/pegasus/build/lib/libpegcommon.1": Text file busy
Fatal error.
make[4]: *** [/var/buildMAIN/pegasus/build/lib/libpegcommon.1] Error 1
make[4]: Leaving directory `/data/buildMAIN/pegasus/src/Pegasus/Common'
make[3]: *** [all] Error 2
make[3]: Leaving directory `/data/buildMAIN/pegasus/src/Pegasus'
make[2]: *** [all] Error 2
make[2]: Leaving directory `/data/buildMAIN/pegasus/src'
make[1]: *** [all] Error 2
make[1]: Leaving directory `/data/buildMAIN/pegasus'
make: *** [build] Error 2