OpenPegasus Nightly Build & Regression Testing Status

Platform Report

Return to Index

Platform HP-UX_11iv3_PA-RISC
Branch RELEASE_2_11-BRANCH
Options +CMPI,+CQL,+IPV6,+PRIVSEP,+SLP,+SQLITE,+SSL,+WSMAN
Date 15-Apr-12 06:17
Contributor HP
Status FAILURE
Data Platform: HP-UX 11iv3 PA-RISC
Branch: RELEASE_2_11-branch
Contributor: HP
Date: 120415
Time: 0617
Options: +CMPI +CQL +IPv6 +PrivSep +SLP +SQLite +SSL +WSMan
Status: FAILURE

EI thread 0: iteration 9: received 4004 instances, et 28.7868 of 60
A thread 4: iteration 4: received 4004 objects, et 26.2376 of 60
---- EI thread 0 caught exception: Connection closed by CIM Server.
---- A thread 4 caught exception: Connection closed by CIM Server.
Expected Results: 57
Actual Results : 52
---- failed tests
make[6]: *** [poststarttests] Error 1
make[6]: Leaving directory `/data/build2.11/pegasus/src/Providers/TestProviders/ChunkingStressProvider/testclient'
make[5]: *** [poststarttests] Error 2
make[5]: Leaving directory `/data/build2.11/pegasus/src/Providers/TestProviders'
make[4]: *** [poststarttests] Error 2
make[4]: Leaving directory `/data/build2.11/pegasus/src/Providers'
make[3]: *** [poststarttests] Error 2
make[3]: Leaving directory `/data/build2.11/pegasus/src'
make[2]: *** [poststarttests] Error 2
make[2]: Leaving directory `/data/build2.11/pegasus'
make[1]: *** [TestBinRepo] Error 2
make[1]: Leaving directory `/data/build2.11/pegasus'
make: *** [serversuite] Error 2