OpenPegasus Nightly Build & Regression Testing Status

Platform Report

Return to Index

Platform X86_64_RHEL5_RPM
Branch RELEASE_2_10-BRANCH
Options  
Date 11-Jun-12 10:25
Contributor HP
Status FAILURE
Data Platform: X86_64 RHEL5 RPM
Branch: RELEASE_2_10-branch
Contributor: HP
Date: 120611
Time: 1025
Status: FAILURE

/usr/share/Pegasus/test/core.22176
/usr/share/Pegasus/test/core.30830
/usr/share/Pegasus/test/core.14319
/usr/share/Pegasus/test/core.29430
/usr/share/Pegasus/test/core.30415
/usr/share/Pegasus/test/core.13447
/usr/share/Pegasus/test/core.1261
/usr/share/Pegasus/test/core.21068
/usr/share/Pegasus/test/core.12533
/usr/share/Pegasus/test/core.10864
/usr/share/Pegasus/test/core.12860
/usr/share/Pegasus/test/core.12454
/usr/share/Pegasus/test/core.19317
/usr/share/Pegasus/test/core.2282
/usr/share/Pegasus/test/core.16693
/usr/share/Pegasus/test/core.1068
/usr/share/Pegasus/test/core.9063
/usr/share/Pegasus/test/core.32518
/usr/share/Pegasus/test/core.4445
make: *** [tests] Error 1