OpenPegasus Nightly Build & Regression Testing Status

Platform Report

Return to Index

Platform LINUX_ZSERIES64_GNU_(SLES10)_(+CMPI,_+ICU,_+SSL)
Branch RELEASE_2_10-BRANCH
Options +CMPI,+ICU,+SSL
Date 13-Dec-12 20:32
Contributor IBM
Status FAILURE
Data
Platform: LINUX_ZSERIES64_GNU (SLES10) (+CMPI, +ICU, +SSL)
Branch: RELEASE_2_10-branch
Date: 121213
Time: 2032 GMT
Contributor: IBM
Options: +CMPI, +ICU, +SSL
Status:FAILURE

-------------------------------------------------------

The Time Format is HHMMSS GMT time

CVS checkout Start time : 203151
CVS checkout End time : 203216



==================================================================
Tests failed for the following error
==================================================================
+++ BadCharacterReference06 passed successfully +++
+++ BadCharacterReference07 passed successfully +++
+++ BadEntityReference01 passed successfully +++
+++ BadEntityReference02 passed successfully +++
+++ BadEntityReference03 passed successfully +++
+++ GoodCharacterReference01 passed successfully +++
+++ GoodCharacterReference02 passed successfully +++
+++ GoodCharacterReference03 passed successfully +++
+++ GoodCharacterReference04 passed successfully +++
+++ GoodEntityReference01 passed successfully +++
+++ BadDtdVersion01 passed successfully +++
+++ BadDtdVersion02 passed successfully +++
+++ BadDtdVersion03 passed successfully +++
+++ BadProtocolVersion01 passed successfully +++
+++ BadProtocolVersion02 passed successfully +++
+++ BadProtocolVersion03 passed successfully +++
make[5]: *** No rule to make target `TooManyProperties01.rsp', needed by `poststarttests'. Stop.
make[5]: Leaving directory `/opt/NightlyBuild/pegasusbuild/pegasus/test/wetest/static/ErrorXml'
make[4]: *** [poststarttests] Error 2
make[4]: Leaving directory `/opt/NightlyBuild/pegasusbuild/pegasus/test/wetest/static'
make[3]: *** [poststarttests] Error 2
make[3]: Leaving directory `/opt/NightlyBuild/pegasusbuild/pegasus/test/wetest'
make[2]: *** [poststarttests] Error 2
make[2]: Leaving directory `/opt/NightlyBuild/pegasusbuild/pegasus/test'
make[1]: *** [poststarttests] Error 2
make[1]: Leaving directory `/opt/NightlyBuild/pegasusbuild/pegasus'
make: *** [serversuite] Error 2
Command exited with non-zero status 2
125.45user 14.36system 12:09.95elapsed 19%CPU (0avgtext+0avgdata 0maxresident)k
0inputs+0outputs (5major+6161049minor)pagefaults 0swaps
==================================================================