OpenPegasus Nightly Build & Regression Testing Status

Platform Report

Return to Index

Platform IA64_SLES9
Branch MAIN
Options +CMPI,+CQL,+IPV6,+PRIVSEP,+SQLITE,+SSL,+WSMAN
Date 01-Oct-13 19:29
Contributor HP
Status FAILURE
Data Platform: IA64 SLES9
Branch: MAIN
Contributor: HP
Date: 131001
Time: 1929
Options: +CMPI +CQL +IPv6 +PrivSep +SQLite +SSL +WSMan
Status: FAILURE

TestProcessIndication cleanup DMTF:CQL
+++++ cleanup completed successfully
+++++ TestProcessIndication passed all tests
make[5]: Leaving directory `/var/buildMAIN/pegasus/src/Pegasus/IndicationService/tests/ProcessIndication'
make[5]: Entering directory `/var/buildMAIN/pegasus/src/Pegasus/IndicationService/tests/Subscription'
TestSubscription register
+++++ register completed successfully
TestSubscription test
PEGASUS_TEST_ASSERT: Assertion `false` in Subscription.cpp:4277 failed
make[5]: *** [poststarttests] Aborted (core dumped)
make[5]: Leaving directory `/var/buildMAIN/pegasus/src/Pegasus/IndicationService/tests/Subscription'
make[4]: *** [poststarttests] Error 2
make[4]: Leaving directory `/var/buildMAIN/pegasus/src/Pegasus/IndicationService/tests'
make[3]: *** [poststarttests] Error 2
make[3]: Leaving directory `/var/buildMAIN/pegasus/src/Pegasus'
make[2]: *** [poststarttests] Error 2
make[2]: Leaving directory `/var/buildMAIN/pegasus/src'
make[1]: *** [poststarttests] Error 2
make[1]: Leaving directory `/var/buildMAIN/pegasus'
make: *** [serversuite] Error 2