OpenPegasus Nightly Build & Regression Testing Status

Platform Report

Return to Index

Platform IA32_RHEL3
Branch MAIN
Options  
Date 20-May-05 02:00
Contributor  
Status FAILURE
Data Platform: IA32 RHEL3
Branch: MAIN
Date: 050520
Time: 0200
Status: FAILURE

REPOSITORY TEST 3: Create Namespace with UTF-16 chars in the name
Note: Skipping this test because the utfrep option was not used In 0.459
Seconds

++++ Test Indication Operations ++++

INDICATION TEST 1: Send an indication containing UTF-16 to a CIMListener
Listening on HTTP port 2003 CIMlistener started Waiting to receive the
indication (timeout is 10sec) Received the indication
make[4]: *** [poststarttests] Killed
make[4]: Leaving directory `/var/buildMAIN/pegasus/src/Clients/g11ntest'
make[3]: *** [poststarttests] Error 2
make[3]: Leaving directory `/var/buildMAIN/pegasus/src/Clients'
make[2]: *** [poststarttests] Error 2
make[2]: Leaving directory `/var/buildMAIN/pegasus/src'
make[1]: *** [poststarttests] Error 2
make[1]: Leaving directory `/var/buildMAIN/pegasus'
make: *** [poststarttests] Error 2