OpenPegasus Nightly Build & Regression Testing Status

Platform Report

Return to Index

Platform IA32_SLES11
Branch MAIN
Options +CMPI,+CQL,+IPV6,+PRIVSEP,+SQLITE,+SSL,+WSMAN
Date 02-Oct-14 07:54
Contributor HP
Status FAILURE
Data Platform: IA32 SLES11
Branch: MAIN
Contributor: HP
Date: 141002
Time: 0754
Options: +CMPI +CQL +IPv6 +PrivSep +SQLite +SSL +WSMan
Status: FAILURE

TestResponseData +++++ passed all tests
make[5]: Leaving directory `/var/buildMAIN/pegasus/src/Pegasus/Common/tests/ResponseData'
make[5]: Entering directory `/var/buildMAIN/pegasus/src/Pegasus/Common/tests/Scope'
TestScope
TestScope +++++ passed all tests
make[5]: Leaving directory `/var/buildMAIN/pegasus/src/Pegasus/Common/tests/Scope'
make[5]: Entering directory `/var/buildMAIN/pegasus/src/Pegasus/Common/tests/SCMO'
TestSCMO
PEGASUS_TEST_ASSERT: Assertion `sizeof(SCMBInstance_Main) == 208` in TestSCMO.cpp:503 failed
make[5]: *** [tests] Aborted (core dumped)
make[5]: Leaving directory `/var/buildMAIN/pegasus/src/Pegasus/Common/tests/SCMO'
make[4]: *** [tests] Error 2
make[4]: Leaving directory `/var/buildMAIN/pegasus/src/Pegasus/Common/tests'
make[3]: *** [tests] Error 2
make[3]: Leaving directory `/var/buildMAIN/pegasus/src/Pegasus'
make[2]: *** [tests] Error 2
make[2]: Leaving directory `/var/buildMAIN/pegasus/src'
make[1]: *** [tests] Error 2
make[1]: Leaving directory `/var/buildMAIN/pegasus'
make: *** [unittests] Error 2