OpenPegasus Nightly Build & Regression Testing Status

Platform Report

Return to Index

Platform IPF_RHAS_2_1
Branch MAIN
Options  
Date 22-Apr-06 05:46
Contributor  
Status FAILURE
Data Platform: IPF RHAS 2.1
Branch: MAIN
Date: 060422
Time: 0546
Status: FAILURE

InstanceModify bypassed because it modifies repository. Set active to execute.
In 4.3e-05 Seconds

++++ Test Associations ++++
Lost connection with cimprovagt "FamilyProviderModule".
Test case failures: 1
+++++ TestClient Failed
make[6]: *** [poststarttests] Error 1
make[6]: Leaving directory `/var/buildMAIN/pegasus/src/Clients/TestClient'
make[5]: *** [poststarttests] Error 2
make[5]: Leaving directory `/var/buildMAIN/pegasus/src/Clients'
make[4]: *** [poststarttests] Error 2
make[4]: Leaving directory `/var/buildMAIN/pegasus/src'
make[3]: *** [poststarttests] Error 2
make[3]: Leaving directory `/var/buildMAIN/pegasus'
make[2]: *** [TestBinRepo] Error 2
make[2]: Leaving directory `/var/buildMAIN/pegasus'
make[1]: *** [serversuite] Error 2
make[1]: Leaving directory `/var/buildMAIN/pegasus'
make: *** [cleanbuild] Error 2