OpenPegasus Nightly Build & Regression Testing Status

Platform Report

Return to Index

Platform LINUX_ZSERIES64_GNU_(SLES10)_(+CMPI,_+ICU)
Branch RELEASE_2_7-BRANCH
Options +CMPI,+ICU
Date 17-Jun-08 19:37
Contributor IBM
Status FAILURE
Data
Platform: LINUX_ZSERIES64_GNU (SLES10) (+CMPI, +ICU)
Branch: RELEASE_2_7-branch
Date: 080617
Time: 1937 GMT
Contributor: IBM
Options: +CMPI, +ICU
Status:FAILURE

-------------------------------------------------------

The Time Format is HHMMSS GMT time

CVS checkout Start time : 193503
CVS checkout End time : 193720



==================================================================
Tests failed for the following error
==================================================================
make[6]: Entering directory `/opt/NightlyBuild/pegasusbuild/pegasus/src/Clients/cimsub/tests/testscript'
++++cimsub tests
++++cimsub tests completed
make[6]: Leaving directory `/opt/NightlyBuild/pegasusbuild/pegasus/src/Clients/cimsub/tests/testscript'
+++ Test passed +++
+++++ cleanup completed successfully
make[5]: Leaving directory `/opt/NightlyBuild/pegasusbuild/pegasus/src/Clients/cimsub/tests/testscript'
make[5]: Entering directory `/opt/NightlyBuild/pegasusbuild/pegasus/src/Clients/cimsub/tests/testscriptInterOp'
make[5]: Nothing to be done for `poststarttests'.
make[5]: Leaving directory `/opt/NightlyBuild/pegasusbuild/pegasus/src/Clients/cimsub/tests/testscriptInterOp'
make[4]: Leaving directory `/opt/NightlyBuild/pegasusbuild/pegasus/src/Clients/cimsub/tests'
make[4]: Entering directory `/opt/NightlyBuild/pegasusbuild/pegasus/src/Clients/repupgrade/SSPModules/SampleSSPModule'
make[4]: Nothing to be done for `poststarttests'.
make[4]: Leaving directory `/opt/NightlyBuild/pegasusbuild/pegasus/src/Clients/repupgrade/SSPModules/SampleSSPModule'
make[4]: Entering directory `/opt/NightlyBuild/pegasusbuild/pegasus/src/Clients/repupgrade/tests'
make[4]: Nothing to be done for `poststarttests'.
make[4]: Leaving directory `/opt/NightlyBuild/pegasusbuild/pegasus/src/Clients/repupgrade/tests'
make[4]: Entering directory `/opt/NightlyBuild/pegasusbuild/pegasus/src/Clients/wbemexec/tests'
make[4]: *** [poststarttests1] Error 1
make[4]: Leaving directory `/opt/NightlyBuild/pegasusbuild/pegasus/src/Clients/wbemexec/tests'
make[3]: *** [poststarttests] Error 2
make[3]: Leaving directory `/opt/NightlyBuild/pegasusbuild/pegasus/src/Clients'
make[2]: *** [poststarttests] Error 2
make[2]: Leaving directory `/opt/NightlyBuild/pegasusbuild/pegasus/src'
make[1]: *** [poststarttests] Error 2
make[1]: Leaving directory `/opt/NightlyBuild/pegasusbuild/pegasus'
make: *** [serversuite] Error 2
Command exited with non-zero status 2
181.46user 34.07system 8:32.95elapsed 42%CPU (0avgtext+0avgdata 0maxresident)k
0inputs+0outputs (0major+3024657minor)pagefaults 0swaps
==================================================================