OpenPegasus Nightly Build & Regression Testing Status

Platform Report

Return to Index

Platform ZOS_ZSERIES_IBM
Branch RELEASE_2_6-BRANCH
Options +BINREP,+CMPI,+ICU,+JMPI,+MCA,+QUERY,+SLP,-SSL
Date 02-Sep-08 20:00
Contributor IBM
Status FAILURE
Data Platform: ZOS_ZSERIES_IBM
Branch: RELEASE_2_6-branch
Date: 080902
Time: 2000
Contributor: IBM
Options: +CMPI,+JMPI,-SSL,+ICU,+SLP,+MCA,+QUERY,+BINREP
Status: FAILURE

-------------------------------------------
OpenPegasus Environment

make[6]: Entering directory `/u/pegnbat/nbat_2_6-branch/pegasus/src/Pegasus/Security/Authentication/tests/LocalAuthFile'
TestLocalAuthFile
TestLocalAuthFile +++++ passed all tests
make[6]: Leaving directory `/u/pegnbat/nbat_2_6-branch/pegasus/src/Pegasus/Security/Authentication/tests/LocalAuthFile'
make[6]: Entering directory `/u/pegnbat/nbat_2_6-branch/pegasus/src/Pegasus/Security/Authentication/tests/LocalAuthenticationHandler'
TestLocalAuthenticationHandler
TestLocalAuthenticationHandler +++++ passed all tests
make[6]: Leaving directory `/u/pegnbat/nbat_2_6-branch/pegasus/src/Pegasus/Security/Authentication/tests/LocalAuthenticationHandler'
make[6]: Entering directory `/u/pegnbat/nbat_2_6-branch/pegasus/src/Pegasus/Security/Authentication/tests/BasicAuthenticationHandler'
mkdir -p ./repository
TestBasicAuthenticationHandler
TestBasicAuthenticationHandler +++++ passed all tests
rm -rf ./repository
make[6]: Leaving directory `/u/pegnbat/nbat_2_6-branch/pegasus/src/Pegasus/Security/Authentication/tests/BasicAuthenticationHandler'
make[6]: Entering directory `/u/pegnbat/nbat_2_6-branch/pegasus/src/Pegasus/Security/Authentication/tests/AuthenticationManager'
mkdir -p ./repository
TestAuthenticationManager
CEE3204S The system detected a protection exception (System Completion Code=0C4).
From entry point std::_ASCII::_LFS_OFF::basic_filebuf >::~basic_filebuf() at
compile unit offset +0000005C at entry offset +0000005C at address 26131CFC.
make[6]: *** [tests] Segmentation fault
make[6]: Leaving directory `/u/pegnbat/nbat_2_6-branch/pegasus/src/Pegasus/Security/Authentication/tests/AuthenticationManager'
make[5]: *** [tests] Error 2
make[5]: Leaving directory `/u/pegnbat/nbat_2_6-branch/pegasus/src/Pegasus/Security/Authentication/tests'
make[4]: *** [tests] Error 2
make[4]: Leaving directory `/u/pegnbat/nbat_2_6-branch/pegasus/src/Pegasus'
make[3]: *** [tests] Error 2
make[3]: Leaving directory `/u/pegnbat/nbat_2_6-branch/pegasus/src'
make[2]: *** [tests] Error 2
make[2]: Leaving directory `/u/pegnbat/nbat_2_6-branch/pegasus'
make[1]: *** [unittests] Error 2
make[1]: Leaving directory `/u/pegnbat/nbat_2_6-branch/pegasus'
make: *** [cleanbuild] Error 2