OpenPegasus Nightly Build & Regression Testing Status

Platform Report

Return to Index

Platform HP-UX_11iv2_PA-RISC
Branch MAIN
Options  
Date 16-Sep-08 08:00
Contributor HP
Status FAILURE
Data Platform: HP-UX 11iv2 PA-RISC
Branch: MAIN
Contributor: HP
Date: 080916
Time: 0800
Status: FAILURE

+++++ Min. Send-Recv Delta time = 2250 milli-seconds
+++++ Max. Send-Recv Delta time = 4687 milli-seconds
+++++ Elapsed time = 4880.97 seconds, or 81.3495 minutes.
+++++ Rate = 0.00204877 indications per second.

+++++ TEST RESULTS: Server Resident Listener
+++++ Number of Test Threads = 1
+++++ Expected Number of Indications = 10
+++++ Number of Indications Received = 9
+++++ Elapsed time = 99.0182 seconds, or 1.6503 minutes.
+++++ Rate = 0.0908924 indications per second.

PEGASUS_TEST_ASSERT failed in file IndicationStressTest.cpp at line 1469
make[3]: *** [run_TS1_HTTPS] IOT trap (core dumped)
make[3]: Leaving directory `/var/buildMAIN/pegasus/src/Providers/TestProviders/IndicationStressTestProvider/testclient'
make[2]: *** [runTestSuite] Error 2
make[2]: Leaving directory `/var/buildMAIN/pegasus'
make[1]: *** [run_INDSSL_TS1] Error 2
make[1]: Leaving directory `/var/buildMAIN/pegasus'
make: *** [serversuite] Error 2

1221556084s-935695us: DiscardedData [2422:1:TLS.cpp:373]: ---> SSL: Not accepted 5 error:00000000:lib(0):func(0):reason(0) client IP address : ::ffff:127.0.0.1
1221556085s-256528us: DiscardedData [2422:19:TLS.cpp:528]: ---> SSL: Not connected 5 error:00000000:lib(0):func(0):reason(0)
1221556085s-257723us: DiscardedData [2422:19:CIMxmlIndicationHandler.cpp:355]: CIMxmlIndicationHandler::handleIndication failed to deliver indication due to Exception: Cannot connect to localhost:5989. Connection failed.
1221556085s-276734us: DiscardedData [2422:12:IndicationService.cpp:2301]: Sending Indication and HandlerService returns CIMException: Cannot connect to localhost:5989. Connection failed.

*********** FAILURE: Unexpected trace found. ************